Target
Nuclear receptor coactivator 3
Ligand
BDBM43179
Substrate
Meas. Tech.
Dose response biochemical High Throughput Screening assay for agonists of the steroid receptor coactivator 3 (SRC-3) recruitment by the peroxisome proliferator-activated receptor gamma (PPARgamma)
EC50
>79370±n/a nM
Citation
 PubChem, PC Dose response biochemical High Throughput Screening assay for agonists of the steroid receptor coactivator 3 (SRC-3) recruitment by the peroxisome proliferator-activated receptor gamma (PPARgamma) PubChem Bioassay (2008)[AID] 
Target
Name:
Nuclear receptor coactivator 3
Synonyms:
AIB1 NCOA3 RAC3 nuclear receptor coactivator 3 isoform a
Type:
Enzyme Catalytic Domain
Mol. Mass.:
155305.29
Organism:
Homo sapiens (Human)
Description:
Q9Y6Q9
Residue:
1424
  
Inhibitor
Name:
BDBM43179
Synonyms:
3-(4-fluorophenyl)-5-hydrazino[1,2,3]triazolo[1,5-a]quinazoline SMR000308439 [3-(4-fluorophenyl)-[1,2,3]triazolo[1,5-a]quinazolin-5-yl]diazane cid_16195388
Type:
Small organic molecule
Emp. Form.:
C15H11FN6
Mol. Mass.:
294.2864
SMILES:
NNc1nc2c(nnn2c2ccccc12)-c1ccc(F)cc1
: