Target
Nuclear receptor coactivator 3
Ligand
BDBM43181
Substrate
Meas. Tech.
Dose response biochemical High Throughput Screening assay for agonists of the steroid receptor coactivator 3 (SRC-3) recruitment by the peroxisome proliferator-activated receptor gamma (PPARgamma)
EC50
>79370±n/a nM
Citation
 PubChem, PC Dose response biochemical High Throughput Screening assay for agonists of the steroid receptor coactivator 3 (SRC-3) recruitment by the peroxisome proliferator-activated receptor gamma (PPARgamma) PubChem Bioassay (2008)[AID] 
Target
Name:
Nuclear receptor coactivator 3
Synonyms:
AIB1 NCOA3 RAC3 nuclear receptor coactivator 3 isoform a
Type:
Enzyme Catalytic Domain
Mol. Mass.:
155305.29
Organism:
Homo sapiens (Human)
Description:
Q9Y6Q9
Residue:
1424
  
Inhibitor
Name:
BDBM43181
Synonyms:
4-(6-bromo-2,4-diketo-1H-quinazolin-3-yl)-N-(4-chlorobenzyl)butyramide 4-(6-bromo-2,4-dioxo-1H-quinazolin-3-yl)-N-[(4-chlorophenyl)methyl]butanamide MLS000730071 cid_16003831
Type:
Small organic molecule
Emp. Form.:
C19H17BrClN3O3
Mol. Mass.:
450.714
SMILES:
Clc1ccc(CNC(=O)CCCn2c(=O)[nH]c3ccc(Br)cc3c2=O)cc1
: