Target
Nuclear receptor coactivator 3
Ligand
BDBM43182
Substrate
Meas. Tech.
Dose response biochemical High Throughput Screening assay for agonists of the steroid receptor coactivator 3 (SRC-3) recruitment by the peroxisome proliferator-activated receptor gamma (PPARgamma)
EC50
>79370±n/a nM
Citation
 PubChem, PC Dose response biochemical High Throughput Screening assay for agonists of the steroid receptor coactivator 3 (SRC-3) recruitment by the peroxisome proliferator-activated receptor gamma (PPARgamma) PubChem Bioassay (2008)[AID] 
Target
Name:
Nuclear receptor coactivator 3
Synonyms:
AIB1 NCOA3 RAC3 nuclear receptor coactivator 3 isoform a
Type:
Enzyme Catalytic Domain
Mol. Mass.:
155305.29
Organism:
Homo sapiens (Human)
Description:
Q9Y6Q9
Residue:
1424
  
Inhibitor
Name:
BDBM43182
Synonyms:
2-(2,6-dihydroxyphenyl)-5-hydroxy-6,7,8-trimethoxy-1-benzopyran-4-one 2-(2,6-dihydroxyphenyl)-5-hydroxy-6,7,8-trimethoxychromen-4-one MLS001049145 cid_1801510
Type:
Small organic molecule
Emp. Form.:
C18H16O8
Mol. Mass.:
360.3148
SMILES:
COc1c(O)c2c(oc(cc2=O)-c2c(O)cccc2O)c(OC)c1OC
: