Target
Nuclear receptor coactivator 3
Ligand
BDBM43184
Substrate
Meas. Tech.
Dose response biochemical High Throughput Screening assay for agonists of the steroid receptor coactivator 3 (SRC-3) recruitment by the peroxisome proliferator-activated receptor gamma (PPARgamma)
EC50
>79370±n/a nM
Citation
 PubChem, PC Dose response biochemical High Throughput Screening assay for agonists of the steroid receptor coactivator 3 (SRC-3) recruitment by the peroxisome proliferator-activated receptor gamma (PPARgamma) PubChem Bioassay (2008)[AID] 
Target
Name:
Nuclear receptor coactivator 3
Synonyms:
AIB1 NCOA3 RAC3 nuclear receptor coactivator 3 isoform a
Type:
Enzyme Catalytic Domain
Mol. Mass.:
155305.29
Organism:
Homo sapiens (Human)
Description:
Q9Y6Q9
Residue:
1424
  
Inhibitor
Name:
BDBM43184
Synonyms:
4-(4-bromophenyl)-N-(2-furanylmethylideneamino)-2-thiazolamine MLS001004674 [4-(4-bromophenyl)thiazol-2-yl]-(2-furfurylideneamino)amine | cid_687727
Type:
Small organic molecule
Emp. Form.:
C14H10BrN3OS
Mol. Mass.:
348.218
SMILES:
Brc1ccc(cc1)-c1csc(N=NCc2ccco2)n1
: