Target
Nuclear receptor coactivator 3
Ligand
BDBM43185
Substrate
Meas. Tech.
Dose response biochemical High Throughput Screening assay for agonists of the steroid receptor coactivator 3 (SRC-3) recruitment by the peroxisome proliferator-activated receptor gamma (PPARgamma)
EC50
>79370±n/a nM
Citation
 PubChem, PC Dose response biochemical High Throughput Screening assay for agonists of the steroid receptor coactivator 3 (SRC-3) recruitment by the peroxisome proliferator-activated receptor gamma (PPARgamma) PubChem Bioassay (2008)[AID] 
Target
Name:
Nuclear receptor coactivator 3
Synonyms:
AIB1 NCOA3 RAC3 nuclear receptor coactivator 3 isoform a
Type:
Enzyme Catalytic Domain
Mol. Mass.:
155305.29
Organism:
Homo sapiens (Human)
Description:
Q9Y6Q9
Residue:
1424
  
Inhibitor
Name:
BDBM43185
Synonyms:
5-[2,5-dimethyl-1-(2-oxolanylmethyl)-3-pyrrolyl]-N-(4-ethoxyphenyl)-6H-1,3,4-thiadiazin-2-amine MLS000517092 [5-[2,5-dimethyl-1-(tetrahydrofurfuryl)pyrrol-3-yl]-6H-1,3,4-thiadiazin-2-yl]-p-phenetyl-amine | cid_4552556
Type:
Small organic molecule
Emp. Form.:
C22H28N4O2S
Mol. Mass.:
412.548
SMILES:
CCOc1ccc(NC2=NN=C(CS2)c2cc(C)n(CC3CCCO3)c2C)cc1
: