Target
Mannose-6-phosphate isomerase
Ligand
BDBM46036
Substrate
Meas. Tech.
Confirmation of compounds inhibiting phosphomannose isomerase (PMI) via a fluorescence intensity assay.
IC50
707±n/a nM
Citation
 PubChem, PC Confirmation of compounds inhibiting phosphomannose isomerase (PMI) via a fluorescence intensity assay. PubChem Bioassay (2010)[AID] 
Target
Name:
Mannose-6-phosphate isomerase
Synonyms:
MPI MPI_HUMAN PMI1
Type:
PROTEIN
Mol. Mass.:
46651.35
Organism:
Homo sapiens (Human)
Description:
ChEMBL_1448919
Residue:
423
  
Inhibitor
Name:
BDBM46036
Synonyms:
2-[[3-(3-keto-1,2-benzothiazol-2-yl)phenyl]sulfonylamino]benzoic acid 2-[[3-(3-oxo-1,2-benzothiazol-2-yl)phenyl]sulfonylamino]benzoic acid cid_4089709
Type:
Small organic molecule
Emp. Form.:
C20H14N2O5S2
Mol. Mass.:
426.466
SMILES:
OC(=O)c1ccccc1NS(=O)(=O)c1cccc(c1)-n1sc2ccccc2c1=O
: