Target
Mannose-6-phosphate isomerase
Ligand
BDBM46087
Substrate
Meas. Tech.
Confirmation of compounds inhibiting phosphomannose isomerase (PMI) via a fluorescence intensity assay.
IC50
1030±n/a nM
Citation
 PubChem, PC Confirmation of compounds inhibiting phosphomannose isomerase (PMI) via a fluorescence intensity assay. PubChem Bioassay (2010)[AID] 
Target
Name:
Mannose-6-phosphate isomerase
Synonyms:
MPI MPI_HUMAN PMI1
Type:
PROTEIN
Mol. Mass.:
46651.35
Organism:
Homo sapiens (Human)
Description:
ChEMBL_1448919
Residue:
423
  
Inhibitor
Name:
BDBM46087
Synonyms:
5-fluoranyl-2-(4-methoxyphenyl)-1,2-benzothiazol-3-one MLS-0390936.0001 | cid_25181243
Type:
Small organic molecule
Emp. Form.:
C14H10FNO2S
Mol. Mass.:
275.298
SMILES:
COc1ccc(cc1)-n1sc2ccc(F)cc2c1=O
: