Target
Mannose-6-phosphate isomerase
Ligand
BDBM43814
Substrate
Meas. Tech.
Confirmation of compounds inhibiting phosphomannose isomerase (PMI) via a fluorescence intensity assay using a high concentration of mannose 6-phosphate.
IC50
>100000±0 nM
Citation
 PubChem, PC Confirmation of compounds inhibiting phosphomannose isomerase (PMI) via a fluorescence intensity assay using a high concentration of mannose 6-phosphate. PubChem Bioassay (2009)[AID] 
Target
Name:
Mannose-6-phosphate isomerase
Synonyms:
MPI MPI_HUMAN PMI1
Type:
PROTEIN
Mol. Mass.:
46651.35
Organism:
Homo sapiens (Human)
Description:
ChEMBL_1448919
Residue:
423
  
Inhibitor
Name:
BDBM43814
Synonyms:
(3Z)-1-butyl-3-[(2-hydroxyphenyl)hydrazinylidene]-2-indolone (3Z)-1-butyl-3-[(2-hydroxyphenyl)hydrazono]oxindole cid_25199560
Type:
Small organic molecule
Emp. Form.:
C18H19N3O2
Mol. Mass.:
309.3624
SMILES:
CCCCN1C(=O)C(=NNc2ccccc2O)c2ccccc12
: