Target
Tyrosine-protein kinase JAK2
Ligand
BDBM47438
Substrate
Meas. Tech.
Luminescent counterscreen for inhibitors of the Janus kinase 2 mutant JAK2V617F: dose response cell-based high throughput screening assay for inhibitors of parental Ba/F3 cell viability.
IC50
6884±n/a nM
Citation
 PubChem, PC Luminescent counterscreen for inhibitors of the Janus kinase 2 mutant JAK2V617F: dose response cell-based high throughput screening assay for inhibitors of parental Ba/F3 cell viability. PubChem Bioassay (2009)[AID] 
Target
Name:
Tyrosine-protein kinase JAK2
Synonyms:
JAK-2 JAK2_HUMAN Janus kinase 2 (JAK2) | Janus kinase 2 (a protein tyrosine kinase)
Type:
Protein
Mol. Mass.:
130684.68
Organism:
Homo sapiens (Human)
Description:
O60674
Residue:
1132
  
Inhibitor
Name:
BDBM47438
Synonyms:
MLS000712620 N-(3-methylphenyl)-5-nitro-furan-2-carboxamide N-(m-tolyl)-5-nitro-2-furamide cid_776890
Type:
Small organic molecule
Emp. Form.:
C12H10N2O4
Mol. Mass.:
246.2188
SMILES:
Cc1cccc(NC(=O)c2ccc(o2)[N+]([O-])=O)c1
: