Target
Glutathione S-transferase Mu 1
Ligand
BDBM47577
Substrate
Meas. Tech.
Profiling Assay to determine GST-GSH interactions in multiplex bead-based assays
EC50
26660±n/a nM
Citation
 PubChem, PC Profiling Assay to determine GST-GSH interactions in multiplex bead-based assays PubChem Bioassay (2010)[AID] 
Target
Name:
Glutathione S-transferase Mu 1
Synonyms:
GST class-mu 1 GSTM1 GSTM1_HUMAN GSTM1b-1b Glutathione S-transferase Mu 1 glutathione S-transferase
Type:
PROTEIN
Mol. Mass.:
25712.03
Organism:
Homo sapiens (Human)
Description:
ChEMBL_799596
Residue:
218
  
Inhibitor
Name:
BDBM47577
Synonyms:
(5Z)-3-ethyl-2-sulfanylidene-5-[(1,2,5-trimethyl-3-pyrrolyl)methylidene]-4-thiazolidinone (5Z)-3-ethyl-2-thioxo-5-[(1,2,5-trimethylpyrrol-3-yl)methylene]thiazolidin-4-one MLS000576648 cid_2584707
Type:
Small organic molecule
Emp. Form.:
C13H16N2OS2
Mol. Mass.:
280.409
SMILES:
CCN1C(=S)S\C(=C/c2cc(C)n(C)c2C)C1=O
: