Target
Glutathione S-transferase Mu 1
Ligand
BDBM50241084
Substrate
Meas. Tech.
Profiling Assay to determine GST-GSH interactions in multiplex bead-based assays
EC50
1750±n/a nM
Citation
 PubChem, PC Profiling Assay to determine GST-GSH interactions in multiplex bead-based assays PubChem Bioassay (2010)[AID] 
Target
Name:
Glutathione S-transferase Mu 1
Synonyms:
GST class-mu 1 GSTM1 GSTM1_HUMAN GSTM1b-1b Glutathione S-transferase Mu 1 glutathione S-transferase
Type:
PROTEIN
Mol. Mass.:
25712.03
Organism:
Homo sapiens (Human)
Description:
ChEMBL_799596
Residue:
218
  
Inhibitor
Name:
BDBM50241084
Synonyms:
3'-Methoxyapigenin 5,7-dihydroxy-2-(4-hydroxy-3-methoxyphenyl)-4-benzopyrone 5,7-dihydroxy-2-(4-hydroxy-3-methoxyphenyl)-4H-chromen-4-one Chryseriol Chrysoeriol (26) cid_5280666
Type:
Small organic molecule
Emp. Form.:
C16H12O6
Mol. Mass.:
300.2629
SMILES:
COc1cc(ccc1O)-c1cc(=O)c2c(O)cc(O)cc2o1
: