Target
ATP-sensitive inward rectifier potassium channel 1
Ligand
BDBM265155
Substrate
Meas. Tech.
Thallium Flux Assay
IC50
8.30±n/a nM
Citation
 Biswas, DDing, FDong, SGu, XJiang, JPasternak, ASuzuki, TVacca, JXu, S Inhibitors of the renal outer medullary potassium channel US Patent  US9718808 Publication Date 8/1/2017 
Target
Name:
ATP-sensitive inward rectifier potassium channel 1
Synonyms:
ATP-regulated potassium channel ROM-K ATP-sensitive inward rectifier potassium channel 1 KCNJ1 Potassium channel (ATP modulatory) ROMK1 The Renal Outer Medullary Potassium (ROMK)
Type:
Enzyme Catalytic Domain
Mol. Mass.:
44809.08
Organism:
Homo sapiens (Human)
Description:
gi_223460826
Residue:
391
  
Inhibitor
Name:
BDBM265155
Synonyms:
US9718808, 12
Type:
Small organic molecule
Emp. Form.:
C9H5FN4O
Mol. Mass.:
204.1606
SMILES:
Fc1c2Cn3nnnc3-c2ccc1C=O
: