Target
Dual specificity protein phosphatase 3
Ligand
BDBM44530
Substrate
Meas. Tech.
SAR VHR1 Fluorescent Assay for In Vitro dose response studies
IC50
>50000±n/a nM
Citation
 PubChem, PC SAR VHR1 Fluorescent Assay for In Vitro dose response studies PubChem Bioassay (2009)[AID] 
Target
Name:
Dual specificity protein phosphatase 3
Synonyms:
DUS3_HUMAN Dual specificity protein phosphatase (VHR) Dual specificity protein phosphatase VHR Tyrosine-protein phosphatase non-receptor type 1 | VHR
Type:
Hydrolase
Mol. Mass.:
20480.58
Organism:
Homo sapiens (Human)
Description:
Residue:
185
  
Inhibitor
Name:
BDBM44530
Synonyms:
3-keto-7-phenyl-5-(2-thienyl)-2-(3,4,5-trimethoxybenzylidene)-5H-thiazolo[3,2-a]pyrimidine-6-carboxylic acid ethyl ester MLS000572607 cid_2885102 ethyl 3-oxo-7-phenyl-5-(2-thienyl)-2-(3,4,5-trimethoxybenzylidene)-2,3-dihydro-5H-[1,3]thiazolo[3,2-a]pyrimidine-6-carboxylate | ethyl 3-oxo-7-phenyl-5-thiophen-2-yl-2-[(3,4,5-trimethoxyphenyl)methylidene]-5H-[1,3]thiazolo[3,2-a]pyrimidine-6-carboxylate
Type:
Small organic molecule
Emp. Form.:
C29H26N2O6S2
Mol. Mass.:
562.657
SMILES:
CCOC(=O)C1=C(N=c2sc(=Cc3cc(OC)c(OC)c(OC)c3)c(=O)n2C1c1cccs1)c1ccccc1
: