Target
Beta-galactosidase
Ligand
BDBM48102
Substrate
Meas. Tech.
HTS Dose response counterscreen for assays utilizing the enzyme, b-galactosidase
EC50
10295±n/a nM
Citation
 PubChem, PC HTS Dose response counterscreen for assays utilizing the enzyme, b-galactosidase PubChem Bioassay (2009)[AID] 
Target
Name:
Beta-galactosidase
Synonyms:
BGAL_ECOLX Lactase | lacZ
Type:
PROTEIN
Mol. Mass.:
116943.87
Organism:
Escherichia coli
Description:
ChEMBL_215882
Residue:
1029
  
Inhibitor
Name:
BDBM48102
Synonyms:
3-methoxy-N-[(5Z)-5-[(3-methoxy-4-oxidanyl-phenyl)methylidene]-4-oxidanylidene-2-sulfanylidene-1,3-thiazolidin-3-yl]-4-oxidanyl-benzamide 4-hydroxy-N-[(5Z)-5-[(4-hydroxy-3-methoxyphenyl)methylidene]-4-oxo-2-sulfanylidene-1,3-thiazolidin-3-yl]-3-methoxybenzamide MLS001164981 cid_1567094
Type:
Small organic molecule
Emp. Form.:
C19H16N2O6S2
Mol. Mass.:
432.47
SMILES:
COc1cc(\C=C2/SC(=S)N(NC(=O)c3ccc(O)c(OC)c3)C2=O)ccc1O
: