Target
Eukaryotic translation initiation factor 4 gamma 1
Ligand
BDBM48800
Substrate
Meas. Tech.
Dose Response Confirmation for Small Molecule Inhibitors of Eukaryotic Translation Initiation
IC50
50000±n/a nM
Citation
 PubChem, PC Dose Response Confirmation for Small Molecule Inhibitors of Eukaryotic Translation Initiation PubChem Bioassay (2009)[AID] 
Target
Name:
Eukaryotic translation initiation factor 4 gamma 1
Synonyms:
EIF4F EIF4G1 IF4G1_HUMAN | eukaryotic translation initiation factor 4 gamma, 1 isoform 4
Type:
Enzyme Catalytic Domain
Mol. Mass.:
175455.17
Organism:
Homo sapiens (Human)
Description:
Q04637
Residue:
1599
  
Inhibitor
Name:
BDBM48800
Synonyms:
2-{[3-(1-methyl-1H-pyrrol-2-yl)-1H-pyrazol-5-yl]carbonyl}-1-pyridin-2-yl-2,3,4,9-tetrahydro-1H-beta-carboline SMR000319554 [3-(1-methylpyrrol-2-yl)-1H-pyrazol-5-yl]-(1-pyridin-2-yl-1,3,4,9-tetrahydropyrido[3,4-b]indol-2-yl)methanone cid_16188951
Type:
Small organic molecule
Emp. Form.:
C25H22N6O
Mol. Mass.:
422.4818
SMILES:
Cn1cccc1-c1cc([nH]n1)C(=O)N1CCc2c([nH]c3ccccc23)C1c1ccccn1
: