Target
Eukaryotic translation initiation factor 4 gamma 1
Ligand
BDBM48862
Substrate
Meas. Tech.
Dose Response Confirmation for Small Molecule Inhibitors of Eukaryotic Translation Initiation
IC50
50000±n/a nM
Citation
 PubChem, PC Dose Response Confirmation for Small Molecule Inhibitors of Eukaryotic Translation Initiation PubChem Bioassay (2009)[AID] 
Target
Name:
Eukaryotic translation initiation factor 4 gamma 1
Synonyms:
EIF4F EIF4G1 IF4G1_HUMAN | eukaryotic translation initiation factor 4 gamma, 1 isoform 4
Type:
Enzyme Catalytic Domain
Mol. Mass.:
175455.17
Organism:
Homo sapiens (Human)
Description:
Q04637
Residue:
1599
  
Inhibitor
Name:
BDBM48862
Synonyms:
6-[(3,4-dichlorophenyl)(1-pyrrolidinyl)methyl]-1,3-benzodioxol-5-ol 6-[(3,4-dichlorophenyl)-pyrrolidin-1-yl-methyl]-1,3-benzodioxol-5-ol 6-[(3,4-dichlorophenyl)-pyrrolidino-methyl]sesamol SMR000338310 | cid_3309922
Type:
Small organic molecule
Emp. Form.:
C18H17Cl2NO3
Mol. Mass.:
366.238
SMILES:
Oc1cc2OCOc2cc1C(N1CCCC1)c1ccc(Cl)c(Cl)c1
: