Target
Transcription factor p65
Ligand
BDBM49496
Substrate
Meas. Tech.
Name: High Throughput Screen to Identify Compounds that increase expression of NF-kB in Human Neuronal Cells - Dose Response
EC50
1221±n/a nM
Citation
 PubChem, PC Name: High Throughput Screen to Identify Compounds that increase expression of NF-kB in Human Neuronal Cells - Dose Response PubChem Bioassay (2008)[AID] 
Target
Name:
Transcription factor p65
Synonyms:
NFKB3 Nuclear factor NF-kappa-B p65 subunit TF65_HUMAN | v-rel reticuloendotheliosis viral oncogene homolog A isoform 1
Type:
Enzyme
Mol. Mass.:
60211.92
Organism:
Homo sapiens (Human)
Description:
Q04206
Residue:
551
  
Inhibitor
Name:
BDBM49496
Synonyms:
(2Z)-2-hex-2-ynylidene-1H-[1,3]thiazolo[3,2-a]benzimidazole 2-(2-hexynylidene)-2,3-dihydro[1,3]thiazolo[3,2-a]benzimidazole SMR000160720 | cid_6523423
Type:
Small organic molecule
Emp. Form.:
C15H14N2S
Mol. Mass.:
254.35
SMILES:
CCCC#C\C=C1\Cn2c(S1)nc1ccccc21
: