Target
Induced myeloid leukemia cell differentiation protein Mcl-1
Ligand
BDBM50451
Substrate
Meas. Tech.
Dose Response Confirmation for Mcl-1/Noxa Interaction Inhibitors
IC50
5892.424708±n/a nM
Citation
 PubChem, PC Dose Response Confirmation for Mcl-1/Noxa Interaction Inhibitors PubChem Bioassay (2008)[AID] 
Target
Name:
Induced myeloid leukemia cell differentiation protein Mcl-1
Synonyms:
BCL2L3 Bcl-2-like protein 3 (Mcl-1) Bcl2-L-3 MCL1 Mcl-1 Myeloid cell leukemia sequence 1 (BCL2-related) | mcl1/EAT
Type:
Membrane; Single-pass membrane protein
Mol. Mass.:
37332.87
Organism:
Homo sapiens (Human)
Description:
Q07820
Residue:
350
  
Inhibitor
Name:
BDBM50451
Synonyms:
1-(4-Chloro-phenyl)-3-[5-((E)-styryl)-[1,3,4]thiadiazol-2-yl]-urea 1-(4-chlorophenyl)-3-[5-[(E)-styryl]-1,3,4-thiadiazol-2-yl]urea SMR000218637 | cid_5885398
Type:
Small organic molecule
Emp. Form.:
C17H13ClN4OS
Mol. Mass.:
356.829
SMILES:
Clc1ccc(NC(=O)Nc2nnc(\C=C\c3ccccc3)s2)cc1
: