Target
Induced myeloid leukemia cell differentiation protein Mcl-1
Ligand
BDBM48862
Substrate
Meas. Tech.
Dose Response Confirmation for Mcl-1/Noxa Interaction Inhibitors
IC50
4757.121435±n/a nM
Citation
 PubChem, PC Dose Response Confirmation for Mcl-1/Noxa Interaction Inhibitors PubChem Bioassay (2008)[AID] 
Target
Name:
Induced myeloid leukemia cell differentiation protein Mcl-1
Synonyms:
BCL2L3 Bcl-2-like protein 3 (Mcl-1) Bcl2-L-3 MCL1 Mcl-1 Myeloid cell leukemia sequence 1 (BCL2-related) | mcl1/EAT
Type:
Membrane; Single-pass membrane protein
Mol. Mass.:
37332.87
Organism:
Homo sapiens (Human)
Description:
Q07820
Residue:
350
  
Inhibitor
Name:
BDBM48862
Synonyms:
6-[(3,4-dichlorophenyl)(1-pyrrolidinyl)methyl]-1,3-benzodioxol-5-ol 6-[(3,4-dichlorophenyl)-pyrrolidin-1-yl-methyl]-1,3-benzodioxol-5-ol 6-[(3,4-dichlorophenyl)-pyrrolidino-methyl]sesamol SMR000338310 | cid_3309922
Type:
Small organic molecule
Emp. Form.:
C18H17Cl2NO3
Mol. Mass.:
366.238
SMILES:
Oc1cc2OCOc2cc1C(N1CCCC1)c1ccc(Cl)c(Cl)c1
: