Target
Induced myeloid leukemia cell differentiation protein Mcl-1
Ligand
BDBM50708
Substrate
Meas. Tech.
Dose Response Confirmation for Mcl-1/Noxa Interaction Inhibitors
IC50
1171.41516±n/a nM
Citation
 PubChem, PC Dose Response Confirmation for Mcl-1/Noxa Interaction Inhibitors PubChem Bioassay (2008)[AID] 
Target
Name:
Induced myeloid leukemia cell differentiation protein Mcl-1
Synonyms:
BCL2L3 Bcl-2-like protein 3 (Mcl-1) Bcl2-L-3 MCL1 Mcl-1 Myeloid cell leukemia sequence 1 (BCL2-related) | mcl1/EAT
Type:
Membrane; Single-pass membrane protein
Mol. Mass.:
37332.87
Organism:
Homo sapiens (Human)
Description:
Q07820
Residue:
350
  
Inhibitor
Name:
BDBM50708
Synonyms:
1-[[(E)-(2,3-dihydroxy-4-keto-cyclohexa-2,5-dien-1-ylidene)methyl]amino]-3-[3-(dimethylsulfamoyl)phenyl]thiourea 1-[[(E)-(2,3-dihydroxy-4-oxocyclohexa-2,5-dien-1-ylidene)methyl]amino]-3-[3-(dimethylsulfamoyl)phenyl]thiourea MLS000776241 cid_5855622
Type:
Small organic molecule
Emp. Form.:
C16H18N4O5S2
Mol. Mass.:
410.468
SMILES:
CN(C)S(=O)(=O)c1cccc(NC(=S)NN=Cc2ccc(O)c(O)c2O)c1
: