Target
Glycoprotein 42
Ligand
BDBM44475
Substrate
Meas. Tech.
Dose Response Confirmation for Small Molecule Inhibitors of Epstein-Barr Virus
IC50
3940±n/a nM
Citation
 PubChem, PC Dose Response Confirmation for Small Molecule Inhibitors of Epstein-Barr Virus PubChem Bioassay (2008)[AID] 
Target
Name:
Glycoprotein 42
Synonyms:
BZLF2 | GP42_EBVA8
Type:
Enzyme Catalytic Domain
Mol. Mass.:
25424.12
Organism:
Human herpesvirus 4 type 2
Description:
gi_139424501
Residue:
223
  
Inhibitor
Name:
BDBM44475
Synonyms:
1-Pentyl-3-phenyl-1H-pyrazolo[3,4-b]quinoxaline 1-pentyl-3-phenyl-pyrazolo[4,3-b]quinoxaline MLS000557568 cid_2031089
Type:
Small organic molecule
Emp. Form.:
C20H20N4
Mol. Mass.:
316.3996
SMILES:
CCCCCn1nc(-c2ccccc2)c2nc3ccccc3nc12
: