Target
Glycoprotein 42
Ligand
BDBM50977
Substrate
Meas. Tech.
Dose Response Confirmation for Small Molecule Inhibitors of Epstein-Barr Virus
IC50
4650±n/a nM
Citation
 PubChem, PC Dose Response Confirmation for Small Molecule Inhibitors of Epstein-Barr Virus PubChem Bioassay (2008)[AID] 
Target
Name:
Glycoprotein 42
Synonyms:
BZLF2 | GP42_EBVA8
Type:
Enzyme Catalytic Domain
Mol. Mass.:
25424.12
Organism:
Human herpesvirus 4 type 2
Description:
gi_139424501
Residue:
223
  
Inhibitor
Name:
BDBM50977
Synonyms:
(5Z)-3-(2-furanylmethyl)-5-[[1-(4-methoxyphenyl)-2,5-dimethyl-3-pyrrolyl]methylidene]-2-sulfanylidene-4-thiazolidinone (5Z)-3-(furan-2-ylmethyl)-5-[[1-(4-methoxyphenyl)-2,5-dimethyl-pyrrol-3-yl]methylidene]-2-sulfanylidene-1,3-thiazolidin-4-one 3-(2-furylmethyl)-5-{[1-(4-methoxyphenyl)-2,5-dimethyl-1H-pyrrol-3-yl]methylene}-2-thioxo-1,3-thiazolidin-4-one SMR000198477 | cid_1310155
Type:
Small organic molecule
Emp. Form.:
C22H20N2O3S2
Mol. Mass.:
424.536
SMILES:
COc1ccc(cc1)-n1c(C)cc(\C=C2/SC(=S)N(Cc3ccco3)C2=O)c1C
: