Target
Glycoprotein 42
Ligand
BDBM51117
Substrate
Meas. Tech.
Dose Response Confirmation for Small Molecule Inhibitors of Epstein-Barr Virus
IC50
24960±n/a nM
Citation
 PubChem, PC Dose Response Confirmation for Small Molecule Inhibitors of Epstein-Barr Virus PubChem Bioassay (2008)[AID] 
Target
Name:
Glycoprotein 42
Synonyms:
BZLF2 | GP42_EBVA8
Type:
Enzyme Catalytic Domain
Mol. Mass.:
25424.12
Organism:
Human herpesvirus 4 type 2
Description:
gi_139424501
Residue:
223
  
Inhibitor
Name:
BDBM51117
Synonyms:
(5E)-5-[[1-(4-methoxyphenyl)-2,5-dimethyl-3-pyrrolyl]methylidene]-3-methyl-2-sulfanylidene-4-thiazolidinone (5E)-5-[[1-(4-methoxyphenyl)-2,5-dimethyl-pyrrol-3-yl]methylidene]-3-methyl-2-sulfanylidene-1,3-thiazolidin-4-one 5-{[1-(4-methoxyphenyl)-2,5-dimethyl-1H-pyrrol-3-yl]methylene}-3-methyl-2-thioxo-1,3-thiazolidin-4-one SMR000270594 | cid_1321364
Type:
Small organic molecule
Emp. Form.:
C18H18N2O2S2
Mol. Mass.:
358.478
SMILES:
COc1ccc(cc1)-n1c(C)cc(\C=C2\SC(=S)N(C)C2=O)c1C
: