Target
Alkaline phosphatase, tissue-nonspecific isozyme
Ligand
BDBM43814
Substrate
Meas. Tech.
SAR assay for compounds activating TNAP in the presence of 100 mM DEA performed in a luminescence assay
EC50
727±n/a nM
Citation
 PubChem, PC SAR assay for compounds activating TNAP in the presence of 100 mM DEA performed in a luminescence assay PubChem Bioassay (2009)[AID] 
Target
Name:
Alkaline phosphatase, tissue-nonspecific isozyme
Synonyms:
ALPL tissue-nonspecific alkaline phosphatase precursor
Type:
PROTEIN
Mol. Mass.:
57306.17
Organism:
Homo sapiens (Human)
Description:
ChEMBL_1448917
Residue:
524
  
Inhibitor
Name:
BDBM43814
Synonyms:
(3Z)-1-butyl-3-[(2-hydroxyphenyl)hydrazinylidene]-2-indolone (3Z)-1-butyl-3-[(2-hydroxyphenyl)hydrazono]oxindole cid_25199560
Type:
Small organic molecule
Emp. Form.:
C18H19N3O2
Mol. Mass.:
309.3624
SMILES:
CCCCN1C(=O)C(=NNc2ccccc2O)c2ccccc12
: