Target
Zinc finger protein mex-5
Ligand
BDBM52218
Substrate
Meas. Tech.
Fluorescent Polarization Homogeneous Dose Response HTS to Indentify Inhibitors of Mex-5 Binding to TCR-2
EC50
300000±n/a nM
Citation
 PubChem, PC Fluorescent Polarization Homogeneous Dose Response HTS to Indentify Inhibitors of Mex-5 Binding to TCR-2 PubChem Bioassay (2009)[AID] 
Target
Name:
Zinc finger protein mex-5
Synonyms:
MEX5_CAEEL mex-5
Type:
Enzyme Catalytic Domain
Mol. Mass.:
52832.78
Organism:
Caenorhabditis elegans
Description:
gi_55976631
Residue:
468
  
Inhibitor
Name:
BDBM52218
Synonyms:
2-amino-5-keto-7,7-dimethyl-4-phenyl-6,8-dihydro-4H-chromene-3-carbonitrile 2-amino-7,7-dimethyl-5-oxo-4-phenyl-6,8-dihydro-4H-chromene-3-carbonitrile MLS000105495 cid_2737879
Type:
Small organic molecule
Emp. Form.:
C18H18N2O2
Mol. Mass.:
294.3477
SMILES:
CC1(C)CC(=O)C2=C(C1)OC(=N)C(C#N)C2c1ccccc1
: