Target
Zinc finger protein mex-5
Ligand
BDBM50977
Substrate
Meas. Tech.
Fluorescent Polarization Homogeneous Dose Response HTS to Indentify Inhibitors of Mex-5 Binding to TCR-2
EC50
121205±n/a nM
Citation
 PubChem, PC Fluorescent Polarization Homogeneous Dose Response HTS to Indentify Inhibitors of Mex-5 Binding to TCR-2 PubChem Bioassay (2009)[AID] 
Target
Name:
Zinc finger protein mex-5
Synonyms:
MEX5_CAEEL mex-5
Type:
Enzyme Catalytic Domain
Mol. Mass.:
52832.78
Organism:
Caenorhabditis elegans
Description:
gi_55976631
Residue:
468
  
Inhibitor
Name:
BDBM50977
Synonyms:
(5Z)-3-(2-furanylmethyl)-5-[[1-(4-methoxyphenyl)-2,5-dimethyl-3-pyrrolyl]methylidene]-2-sulfanylidene-4-thiazolidinone (5Z)-3-(furan-2-ylmethyl)-5-[[1-(4-methoxyphenyl)-2,5-dimethyl-pyrrol-3-yl]methylidene]-2-sulfanylidene-1,3-thiazolidin-4-one 3-(2-furylmethyl)-5-{[1-(4-methoxyphenyl)-2,5-dimethyl-1H-pyrrol-3-yl]methylene}-2-thioxo-1,3-thiazolidin-4-one SMR000198477 | cid_1310155
Type:
Small organic molecule
Emp. Form.:
C22H20N2O3S2
Mol. Mass.:
424.536
SMILES:
COc1ccc(cc1)-n1c(C)cc(\C=C2/SC(=S)N(Cc3ccco3)C2=O)c1C
: