Target
POsterior Segregation
Ligand
BDBM53082
Substrate
Meas. Tech.
Fluorescent Polarization Homogeneous Dose Response HTS to Indentify Inhibitors of POS-1 Binding to mex-3-RNA
EC50
18558±n/a nM
Citation
 PubChem, PC Fluorescent Polarization Homogeneous Dose Response HTS to Indentify Inhibitors of POS-1 Binding to mex-3-RNA PubChem Bioassay (2009)[AID] 
Target
Name:
POsterior Segregation
Synonyms:
POsterior Segregation family member (pos-1)
Type:
Enzyme Catalytic Domain
Mol. Mass.:
29838.90
Organism:
Caenorhabditis elegans
Description:
gi_17562800
Residue:
264
  
Inhibitor
Name:
BDBM53082
Synonyms:
4-Chloro-7-methyl-3-(phenyl-hydrazono)-1,3-dihydro-indol-2-one 4-chloro-7-methyl-3-(2-phenylhydrazinyl)indol-2-one 4-chloro-7-methyl-3-(phenylhydrazo)-2-indolone SMR000513316 | cid_5752240
Type:
Small organic molecule
Emp. Form.:
C15H12ClN3O
Mol. Mass.:
285.728
SMILES:
Cc1ccc(Cl)c2=C(NNc3ccccc3)C(=O)N=c12
: