Target
POsterior Segregation
Ligand
BDBM37138
Substrate
Meas. Tech.
Fluorescent Polarization Homogeneous Dose Response HTS to Indentify Inhibitors of POS-1 Binding to mex-3-RNA
EC50
7798±n/a nM
Citation
 PubChem, PC Fluorescent Polarization Homogeneous Dose Response HTS to Indentify Inhibitors of POS-1 Binding to mex-3-RNA PubChem Bioassay (2009)[AID] 
Target
Name:
POsterior Segregation
Synonyms:
POsterior Segregation family member (pos-1)
Type:
Enzyme Catalytic Domain
Mol. Mass.:
29838.90
Organism:
Caenorhabditis elegans
Description:
gi_17562800
Residue:
264
  
Inhibitor
Name:
BDBM37138
Synonyms:
6-(4-methyl-1-piperazinyl)-2-(8-methyl-5-quinolinyl)-1H-benzo[de]isoquinoline-1,3(2H)-dione 6-(4-methylpiperazin-1-yl)-2-(8-methylquinolin-5-yl)benzo[de]isoquinoline-1,3-dione MLS000089012 cid_2193273
Type:
Small organic molecule
Emp. Form.:
C27H24N4O2
Mol. Mass.:
436.5051
SMILES:
CN1CCN(CC1)c1ccc2C(=O)N(C(=O)c3cccc1c23)c1ccc(C)c2ncccc12
: