Target
POsterior Segregation
Ligand
BDBM52663
Substrate
Meas. Tech.
Fluorescent Polarization Homogeneous Dose Response HTS to Indentify Inhibitors of POS-1 Binding to mex-3-RNA
EC50
300000±n/a nM
Citation
 PubChem, PC Fluorescent Polarization Homogeneous Dose Response HTS to Indentify Inhibitors of POS-1 Binding to mex-3-RNA PubChem Bioassay (2009)[AID] 
Target
Name:
POsterior Segregation
Synonyms:
POsterior Segregation family member (pos-1)
Type:
Enzyme Catalytic Domain
Mol. Mass.:
29838.90
Organism:
Caenorhabditis elegans
Description:
gi_17562800
Residue:
264
  
Inhibitor
Name:
BDBM52663
Synonyms:
4-keto-N-(3-methoxypropyl)-4-[N'-(2-methyl-[1,2,4]triazolo[1,5-c]quinazolin-5-yl)hydrazino]butyramide N-(3-methoxypropyl)-4-[(2-methyl-[1,2,4]triazolo[1,5-c]quinazolin-5-yl)hydrazo]-4-oxobutanamide N-(3-methoxypropyl)-4-[2-(2-methyl-[1,2,4]triazolo[1,5-c]quinazolin-5-yl)hydrazinyl]-4-oxobutanamide SMR000309581 | cid_16009017
Type:
Small organic molecule
Emp. Form.:
C18H23N7O3
Mol. Mass.:
385.4203
SMILES:
COCCCNC(=O)CCC(=O)NNc1nc2ccccc2c2nc(C)nn12
: