Target
Ubiquitin carboxyl-terminal hydrolase isozyme L1
Ligand
BDBM53413
Substrate
Meas. Tech.
Inhibition Activity Assay
pH
7.6±0
Temperature
298.15±0 K
IC50
6e+3± 1e+3 nM
Citation
 Liu, YLashuel, HAChoi, SXing, XCase, ANi, JYeh, LACuny, GDStein, RLLansbury, PT Discovery of inhibitors that elucidate the role of UCH-L1 activity in the H1299 lung cancer cell line. Chem Biol 10:837-46 (2003)  
Target
Name:
Ubiquitin carboxyl-terminal hydrolase isozyme L1
Synonyms:
UCH-L1 Ubiquitin carboxyl-terminal hydrolase isozyme L1 (UCH-L1) Uchl1
Type:
Protein
Mol. Mass.:
24830.93
Organism:
Mus musculus (Mouse)
Description:
Q9R0P9
Residue:
223
  
Inhibitor
Name:
BDBM53413
Synonyms:
(2S)-2-[[[4-[(4-methylanilino)-oxomethyl]-1H-imidazol-5-yl]-oxomethyl]amino]-6-[[(2-methylpropan-2-yl)oxy-oxomethyl]amino]hexanoic acid tert-butyl ester ILP-IV-50 MLS000849601 cid_16746604 tert-butyl (2S)-2-[[4-[(4-methylphenyl)carbamoyl]-1H-imidazole-5-carbonyl]amino]-6-[(2-methylpropan-2-yl)oxycarbonylamino]hexanoate
Type:
Small organic molecule
Emp. Form.:
C27H39N5O6
Mol. Mass.:
529.6285
SMILES:
Cc1ccc(NC(=O)c2[nH]cnc2C(=O)N[C@@H](CCCCNC(=O)OC(C)(C)C)C(=O)OC(C)(C)C)cc1
: