Target
Ubiquitin carboxyl-terminal hydrolase isozyme L1
Ligand
BDBM53414
Substrate
Meas. Tech.
Inhibition Activity Assay
pH
7.6±0
Temperature
298.15±0 K
IC50
1.2e+4± 1e+3 nM
Citation
 Liu, YLashuel, HAChoi, SXing, XCase, ANi, JYeh, LACuny, GDStein, RLLansbury, PT Discovery of inhibitors that elucidate the role of UCH-L1 activity in the H1299 lung cancer cell line. Chem Biol 10:837-46 (2003)  
Target
Name:
Ubiquitin carboxyl-terminal hydrolase isozyme L1
Synonyms:
UCH-L1 Ubiquitin carboxyl-terminal hydrolase isozyme L1 (UCH-L1) Uchl1
Type:
Protein
Mol. Mass.:
24830.93
Organism:
Mus musculus (Mouse)
Description:
Q9R0P9
Residue:
223
  
Inhibitor
Name:
BDBM53414
Synonyms:
(2S)-4-methyl-2-[[4-(m-tolylcarbamoyl)-1H-imidazole-5-carbonyl]amino]valeric acid benzyl ester (phenylmethyl) (2S)-4-methyl-2-[[4-[(3-methylphenyl)carbamoyl]-1H-imidazol-5-yl]carbonylamino]pentanoate Isatin, 2 SMR000465877 cid_16746610
Type:
Small organic molecule
Emp. Form.:
C25H28N4O4
Mol. Mass.:
448.5142
SMILES:
CC(C)C[C@H](NC(=O)c1nc[nH]c1C(=O)Nc1cccc(C)c1)C(=O)OCc1ccccc1
: