Target
Ubiquitin carboxyl-terminal hydrolase isozyme L1
Ligand
BDBM53426
Substrate
Meas. Tech.
Inhibition Activity Assay
pH
7.6±0
Temperature
298.15±0 K
IC50
4.1e+3±n/a nM
Citation
 Liu, YLashuel, HAChoi, SXing, XCase, ANi, JYeh, LACuny, GDStein, RLLansbury, PT Discovery of inhibitors that elucidate the role of UCH-L1 activity in the H1299 lung cancer cell line. Chem Biol 10:837-46 (2003)  
Target
Name:
Ubiquitin carboxyl-terminal hydrolase isozyme L1
Synonyms:
UCH-L1 Ubiquitin carboxyl-terminal hydrolase isozyme L1 (UCH-L1) Uchl1
Type:
Protein
Mol. Mass.:
24830.93
Organism:
Mus musculus (Mouse)
Description:
Q9R0P9
Residue:
223
  
Inhibitor
Name:
BDBM53426
Synonyms:
Acylated oxime isatin derivative, 15 SMR000470964 gerontoxanthone A
Type:
Small organic molecule
Emp. Form.:
C23H22O6
Mol. Mass.:
394.4172
SMILES:
CC1Oc2cc3oc4c(O)c5OC(C)(C)C=Cc5cc4c(=O)c3c(O)c2C1(C)C
: