Target
Ubiquitin carboxyl-terminal hydrolase isozyme L1
Ligand
BDBM53427
Substrate
Meas. Tech.
Inhibition Activity Assay
pH
7.6±0
Temperature
298.15±0 K
IC50
6.1e+3±n/a nM
Citation
 Liu, YLashuel, HAChoi, SXing, XCase, ANi, JYeh, LACuny, GDStein, RLLansbury, PT Discovery of inhibitors that elucidate the role of UCH-L1 activity in the H1299 lung cancer cell line. Chem Biol 10:837-46 (2003)  
Target
Name:
Ubiquitin carboxyl-terminal hydrolase isozyme L1
Synonyms:
UCH-L1 Ubiquitin carboxyl-terminal hydrolase isozyme L1 (UCH-L1) Uchl1
Type:
Protein
Mol. Mass.:
24830.93
Organism:
Mus musculus (Mouse)
Description:
Q9R0P9
Residue:
223
  
Inhibitor
Name:
BDBM53427
Synonyms:
4-[(3R)-8,8-dimethyl-3,4-dihydro-2H-pyrano[2,3-f][1]benzopyran-3-yl]-6-(3-methylbut-2-enyl)benzene-1,3-diol 4-[(3R)-8,8-dimethyl-3,4-dihydro-2H-pyrano[2,3-f]chromen-3-yl]-6-(3-methylbut-2-enyl)resorcinol Acylated oxime isatin derivative, 16 SMR000470943 | cid_23641093
Type:
Small organic molecule
Emp. Form.:
C25H28O4
Mol. Mass.:
392.4874
SMILES:
[#6]\[#6](-[#6])=[#6]\[#6]-c1cc(-[#6@@H]-2-[#6]-[#8]-c3c(-[#6]-2)ccc2-[#8]C([#6])([#6])[#6]=[#6]-c32)c(-[#8])cc1-[#8]
: