Target
Ubiquitin carboxyl-terminal hydrolase isozyme L1
Ligand
BDBM53447
Substrate
Meas. Tech.
Inhibition Activity Assay
pH
7.6±0
Temperature
298.15±0 K
IC50
3.4e+3±n/a nM
Citation
 Liu, YLashuel, HAChoi, SXing, XCase, ANi, JYeh, LACuny, GDStein, RLLansbury, PT Discovery of inhibitors that elucidate the role of UCH-L1 activity in the H1299 lung cancer cell line. Chem Biol 10:837-46 (2003)  
Target
Name:
Ubiquitin carboxyl-terminal hydrolase isozyme L1
Synonyms:
UCH-L1 Ubiquitin carboxyl-terminal hydrolase isozyme L1 (UCH-L1) Uchl1
Type:
Protein
Mol. Mass.:
24830.93
Organism:
Mus musculus (Mouse)
Description:
Q9R0P9
Residue:
223
  
Inhibitor
Name:
BDBM53447
Synonyms:
4,4'-[1,4-phenylenebis(oxy)]diphenol 4-[4-(4-oxidanylphenoxy)phenoxy]phenol O-acyl oxime isatin derivative, 13 cid_786365
Type:
Small organic molecule
Emp. Form.:
C18H14O4
Mol. Mass.:
294.3014
SMILES:
Oc1ccc(Oc2ccc(Oc3ccc(O)cc3)cc2)cc1
: