Target
Ubiquitin carboxyl-terminal hydrolase isozyme L1
Ligand
BDBM53454
Substrate
Meas. Tech.
Inhibition Activity Assay
pH
7.6±0
Temperature
298.15±0 K
IC50
1.2e+4±n/a nM
Citation
 Liu, YLashuel, HAChoi, SXing, XCase, ANi, JYeh, LACuny, GDStein, RLLansbury, PT Discovery of inhibitors that elucidate the role of UCH-L1 activity in the H1299 lung cancer cell line. Chem Biol 10:837-46 (2003)  
Target
Name:
Ubiquitin carboxyl-terminal hydrolase isozyme L1
Synonyms:
UCH-L1 Ubiquitin carboxyl-terminal hydrolase isozyme L1 (UCH-L1) Uchl1
Type:
Protein
Mol. Mass.:
24830.93
Organism:
Mus musculus (Mouse)
Description:
Q9R0P9
Residue:
223
  
Inhibitor
Name:
BDBM53454
Synonyms:
(2E)-2-[(2Z)-2-(3-methoxy-4-oxidanylidene-cyclohexa-2,5-dien-1-ylidene)ethylidene]-3-(4-methoxyphenyl)-1H-quinazolin-4-one (2E)-2-[(2Z)-2-(3-methoxy-4-oxocyclohexa-2,5-dien-1-ylidene)ethylidene]-3-(4-methoxyphenyl)-1H-quinazolin-4-one 2-[2-(4-Hydroxy-3-methoxy-phenyl)-vinyl]-3-(4-methoxy-phenyl)-3H-quinazolin-4-one O-acyl oxime isatin derivative, 3 cid_5762771
Type:
Small organic molecule
Emp. Form.:
C24H20N2O4
Mol. Mass.:
400.4266
SMILES:
COc1ccc(cc1)-n1c(C=Cc2ccc(O)c(OC)c2)nc2ccccc2c1=O
: