Target
Ubiquitin carboxyl-terminal hydrolase isozyme L1
Ligand
BDBM53473
Substrate
Meas. Tech.
Inhibition Activity Assay
pH
7.6±0
Temperature
298.15±0 K
IC50
5.8e+3±n/a nM
Citation
 Liu, YLashuel, HAChoi, SXing, XCase, ANi, JYeh, LACuny, GDStein, RLLansbury, PT Discovery of inhibitors that elucidate the role of UCH-L1 activity in the H1299 lung cancer cell line. Chem Biol 10:837-46 (2003)  
Target
Name:
Ubiquitin carboxyl-terminal hydrolase isozyme L1
Synonyms:
UCH-L1 Ubiquitin carboxyl-terminal hydrolase isozyme L1 (UCH-L1) Uchl1
Type:
Protein
Mol. Mass.:
24830.93
Organism:
Mus musculus (Mouse)
Description:
Q9R0P9
Residue:
223
  
Inhibitor
Name:
BDBM53473
Synonyms:
(4,5-dimethylthiazol-2-yl)-(piperonylideneamino)amine N-(1,3-benzodioxol-5-ylmethylideneamino)-4,5-dimethyl-1,3-thiazol-2-amine N-Benzo[1,3]dioxol-5-ylmethylene-N'-(4,5-dimethyl-thiazol-2-yl)-hydrazine SMR000514729 | cid_2873173
Type:
Small organic molecule
Emp. Form.:
C13H13N3O2S
Mol. Mass.:
275.326
SMILES:
Cc1nc(N=NCc2ccc3OCOc3c2)sc1C
: