Target
Ubiquitin carboxyl-terminal hydrolase isozyme L1
Ligand
BDBM53479
Substrate
Meas. Tech.
Inhibition Activity Assay
pH
7.6±0
Temperature
298.15±0 K
IC50
1.5e+4±n/a nM
Citation
 Liu, YLashuel, HAChoi, SXing, XCase, ANi, JYeh, LACuny, GDStein, RLLansbury, PT Discovery of inhibitors that elucidate the role of UCH-L1 activity in the H1299 lung cancer cell line. Chem Biol 10:837-46 (2003)  
Target
Name:
Ubiquitin carboxyl-terminal hydrolase isozyme L1
Synonyms:
UCH-L1 Ubiquitin carboxyl-terminal hydrolase isozyme L1 (UCH-L1) Uchl1
Type:
Protein
Mol. Mass.:
24830.93
Organism:
Mus musculus (Mouse)
Description:
Q9R0P9
Residue:
223
  
Inhibitor
Name:
BDBM53479
Synonyms:
(1Z)-1-[(5-tert-butyl-2-hydroxy-anilino)methylene]naphthalen-2-one (1Z)-1-[(5-tert-butyl-2-hydroxyanilino)methylidene]naphthalen-2-one 1-[(5-tert-Butyl-2-hydroxy-phenylimino)-methyl]-naphthalen-2-ol O-acyl oxime isatin derivative, 60 cid_5409850
Type:
Small organic molecule
Emp. Form.:
C21H21NO2
Mol. Mass.:
319.3969
SMILES:
CC(C)(C)c1ccc(O)c(c1)N=Cc1c(O)ccc2ccccc12
: