Target
Mannose-6-phosphate isomerase
Ligand
BDBM34652
Substrate
Meas. Tech.
HTS identification of compounds inhibiting phosphomannose isomerase (PMI) via a fluorescence intensity assay.
IC50
50000±n/a nM
Citation
 PubChem, PC HTS identification of compounds inhibiting phosphomannose isomerase (PMI) via a fluorescence intensity assay. PubChem Bioassay (2009)[AID] 
Target
Name:
Mannose-6-phosphate isomerase
Synonyms:
MPI MPI_HUMAN PMI1
Type:
PROTEIN
Mol. Mass.:
46651.35
Organism:
Homo sapiens (Human)
Description:
ChEMBL_1448919
Residue:
423
  
Inhibitor
Name:
BDBM34652
Synonyms:
(+)-ISOPROTERENOL (+)-BITARTRATE SALT 2,3-dihydroxybutanedioic acid;4-[(1S)-1-hydroxy-2-(propan-2-ylamino)ethyl]benzene-1,2-diol MLS000028736 cid_6852409
Type:
Small organic molecule
Emp. Form.:
C11H17NO3
Mol. Mass.:
211.2576
SMILES:
CC(C)NC[C@@H](O)c1ccc(O)c(O)c1
: