Target
M1 family aminopeptidase
Ligand
BDBM53901
Substrate
Meas. Tech.
Inhibitors of Plasmodium falciparum M1- Family Alanyl Aminopeptidase (M1AAP)
IC50
6870±n/a nM
Citation
 PubChem, PC Inhibitors of Plasmodium falciparum M1- Family Alanyl Aminopeptidase (M1AAP) PubChem Bioassay (2008)[AID] 
Target
Name:
M1 family aminopeptidase
Synonyms:
AMPN_PLAF7 Zinc aminopeptidase | m1-family aminopeptidase
Type:
PROTEIN
Mol. Mass.:
126072.31
Organism:
Plasmodium falciparum (isolate FcB1 / Columbia)
Description:
ChEMBL_735637
Residue:
1085
  
Inhibitor
Name:
BDBM53901
Synonyms:
MLS000727699 N-(4-ketospiro[1H-quinazoline-2,1'-cyclohexane]-3-yl)benzamide N-(4-oxo-3-spiro[1H-quinazoline-2,1'-cyclohexane]yl)benzamide SMR000306396 | cid_1516805
Type:
Small organic molecule
Emp. Form.:
C20H21N3O2
Mol. Mass.:
335.3996
SMILES:
O=C(NN1C(=O)c2ccccc2NC11CCCCC1)c1ccccc1
: