Target
M1 family aminopeptidase
Ligand
BDBM53946
Substrate
Meas. Tech.
Inhibitors of Plasmodium falciparum M1- Family Alanyl Aminopeptidase (M1AAP)
IC50
1000±n/a nM
Citation
 PubChem, PC Inhibitors of Plasmodium falciparum M1- Family Alanyl Aminopeptidase (M1AAP) PubChem Bioassay (2008)[AID] 
Target
Name:
M1 family aminopeptidase
Synonyms:
AMPN_PLAF7 Zinc aminopeptidase | m1-family aminopeptidase
Type:
PROTEIN
Mol. Mass.:
126072.31
Organism:
Plasmodium falciparum (isolate FcB1 / Columbia)
Description:
ChEMBL_735637
Residue:
1085
  
Inhibitor
Name:
BDBM53946
Synonyms:
4-[(N'E)-N'-(6-ketocyclohexa-2,4-dien-1-ylidene)hydrazino]-5-methyl-2-phenyl-3-pyrazolin-3-one 5-methyl-4-[(2E)-2-(6-oxo-1-cyclohexa-2,4-dienylidene)hydrazinyl]-2-phenyl-1H-pyrazol-3-one MLS000713328 cid_5400473
Type:
Small organic molecule
Emp. Form.:
C16H14N4O2
Mol. Mass.:
294.308
SMILES:
Cc1[nH]n(-c2ccccc2)c(=O)c1N=Nc1ccccc1O
: