Target
M1 family aminopeptidase
Ligand
BDBM53972
Substrate
Meas. Tech.
Inhibitors of Plasmodium falciparum M1- Family Alanyl Aminopeptidase (M1AAP)
IC50
8540±n/a nM
Citation
 PubChem, PC Inhibitors of Plasmodium falciparum M1- Family Alanyl Aminopeptidase (M1AAP) PubChem Bioassay (2008)[AID] 
Target
Name:
M1 family aminopeptidase
Synonyms:
AMPN_PLAF7 Zinc aminopeptidase | m1-family aminopeptidase
Type:
PROTEIN
Mol. Mass.:
126072.31
Organism:
Plasmodium falciparum (isolate FcB1 / Columbia)
Description:
ChEMBL_735637
Residue:
1085
  
Inhibitor
Name:
BDBM53972
Synonyms:
MLS000710135 N-(2-cyclobutyl-4-oxidanylidene-quinazolin-3-yl)thiophene-2-carboxamide N-(2-cyclobutyl-4-oxoquinazolin-3-yl)thiophene-2-carboxamide cid_1457777
Type:
Small organic molecule
Emp. Form.:
C17H15N3O2S
Mol. Mass.:
325.385
SMILES:
O=C(Nn1c(nc2ccccc2c1=O)C1CCC1)c1cccs1
: