Target
M1 family aminopeptidase
Ligand
BDBM50503
Substrate
Meas. Tech.
Inhibitors of Plasmodium falciparum M1- Family Alanyl Aminopeptidase (M1AAP)
IC50
9700±n/a nM
Citation
 PubChem, PC Inhibitors of Plasmodium falciparum M1- Family Alanyl Aminopeptidase (M1AAP) PubChem Bioassay (2008)[AID] 
Target
Name:
M1 family aminopeptidase
Synonyms:
AMPN_PLAF7 Zinc aminopeptidase | m1-family aminopeptidase
Type:
PROTEIN
Mol. Mass.:
126072.31
Organism:
Plasmodium falciparum (isolate FcB1 / Columbia)
Description:
ChEMBL_735637
Residue:
1085
  
Inhibitor
Name:
BDBM50503
Synonyms:
2-hydroxy-4-[[4-(2-ketochromen-3-yl)thiazol-2-yl]amino]benzoic acid 2-hydroxy-4-[[4-(2-oxochromen-3-yl)-1,3-thiazol-2-yl]amino]benzoic acid MLS000715729 cid_1075912
Type:
Small organic molecule
Emp. Form.:
C19H12N2O5S
Mol. Mass.:
380.374
SMILES:
OC(=O)c1ccc(Nc2nc(cs2)-c2cc3ccccc3oc2=O)cc1O
: