Target
M1 family aminopeptidase
Ligand
BDBM50709
Substrate
Meas. Tech.
Inhibitors of Plasmodium falciparum M1- Family Alanyl Aminopeptidase (M1AAP)
IC50
4170±n/a nM
Citation
 PubChem, PC Inhibitors of Plasmodium falciparum M1- Family Alanyl Aminopeptidase (M1AAP) PubChem Bioassay (2008)[AID] 
Target
Name:
M1 family aminopeptidase
Synonyms:
AMPN_PLAF7 Zinc aminopeptidase | m1-family aminopeptidase
Type:
PROTEIN
Mol. Mass.:
126072.31
Organism:
Plasmodium falciparum (isolate FcB1 / Columbia)
Description:
ChEMBL_735637
Residue:
1085
  
Inhibitor
Name:
BDBM50709
Synonyms:
2-[[4-[2-[(4-methoxyphenyl)carbamothioyl]hydrazinyl]-3-nitro-phenyl]sulfonylamino]benzoic acid 2-[[4-[N'-[(4-methoxyphenyl)thiocarbamoyl]hydrazino]-3-nitro-phenyl]sulfonylamino]benzoic acid MLS001003095 cid_3967587
Type:
Small organic molecule
Emp. Form.:
C21H19N5O7S2
Mol. Mass.:
517.535
SMILES:
COc1ccc(NC(=S)NNc2ccc(cc2[N+]([O-])=O)S(=O)(=O)Nc2ccccc2C(O)=O)cc1
: