Target
Cell division control protein 42 homolog
Ligand
BDBM54607
Substrate
Meas. Tech.
Pyrazoline SAR compounds tested via Multiplex dose response to identify specific small molecule inhibitors of Ras and Ras-related GTPases specifically Cdc42 activated mutant
EC50
70±n/a nM
Citation
 PubChem, PC Pyrazoline SAR compounds tested via Multiplex dose response to identify specific small molecule inhibitors of Ras and Ras-related GTPases specifically Cdc42 activated mutant PubChem Bioassay (2009)[AID] 
Target
Name:
Cell division control protein 42 homolog
Synonyms:
CDC42 Cell division control protein 42 homolog cell division cycle 42 (GTP binding protein, 25kDa)
Type:
PROTEIN
Mol. Mass.:
21258.36
Organism:
Homo sapiens (Human)
Description:
ChEMBL_652970
Residue:
191
  
Inhibitor
Name:
BDBM54607
Synonyms:
4-(2,5-diphenyl-3,4-dihydropyrazol-3-yl)-N,N-dimethyl-aniline UNM-0000305845 cid_2729182
Type:
Small organic molecule
Emp. Form.:
C23H23N3
Mol. Mass.:
341.4488
SMILES:
CN(C)c1ccc(cc1)C1CC(=NN1c1ccccc1)c1ccccc1
: