Target
GTPase KRas [1-37]
Ligand
BDBM54570
Substrate
Meas. Tech.
Oxadiazole SAR compounds tested via Multiplex dose response to identify specific small molecule inhibitors of Ras and Ras-related GTPases specifically Ras activated mutant
EC50
30000±n/a nM
Citation
 PubChem, PC Oxadiazole SAR compounds tested via Multiplex dose response to identify specific small molecule inhibitors of Ras and Ras-related GTPases specifically Ras activated mutant PubChem Bioassay (2009)[AID] 
Target
Name:
GTPase KRas [1-37]
Synonyms:
ras protein
Type:
Enzyme Catalytic Domain
Mol. Mass.:
4034.04
Organism:
Homo sapiens (Human)
Description:
gi_190938
Residue:
37
  
Inhibitor
Name:
BDBM54570
Synonyms:
3-[3-(4-methoxyphenyl)-1,2,4-oxadiazol-5-yl]-1-[4-(4-methoxyphenyl)-1-piperazinyl]-1-propanone 3-[3-(4-methoxyphenyl)-1,2,4-oxadiazol-5-yl]-1-[4-(4-methoxyphenyl)piperazino]propan-1-one UNM-0000306114 | cid_20851547
Type:
Small organic molecule
Emp. Form.:
C23H26N4O4
Mol. Mass.:
422.4769
SMILES:
COc1ccc(cc1)N1CCN(CC1)C(=O)CCc1nc(no1)-c1ccc(OC)cc1
: