Target
Ras-related protein Rab-2A
Ligand
BDBM54607
Substrate
Meas. Tech.
Pyrazoline SAR compounds tested via Multiplex dose response to identify specific small molecule inhibitors of Ras and Ras-related GTPases specifically Rab2 wildtype
EC50
30000±n/a nM
Comments
Extracted from aid = 2045 and tid = 2
Citation
 PubChem, PC Pyrazoline SAR compounds tested via Multiplex dose response to identify specific small molecule inhibitors of Ras and Ras-related GTPases specifically Rab2 wildtype PubChem Bioassay (2016)[AID] 
Target
Name:
Ras-related protein Rab-2A
Synonyms:
RAB2 RAB2A_CANLF | Ras-related protein Rab-2A.
Type:
Enzyme Catalytic Domain
Mol. Mass.:
23545.28
Organism:
Canis lupus familiaris
Description:
gi_46577642
Residue:
212
  
Inhibitor
Name:
BDBM54607
Synonyms:
4-(2,5-diphenyl-3,4-dihydropyrazol-3-yl)-N,N-dimethyl-aniline UNM-0000305845 cid_2729182
Type:
Small organic molecule
Emp. Form.:
C23H23N3
Mol. Mass.:
341.4488
SMILES:
CN(C)c1ccc(cc1)C1CC(=NN1c1ccccc1)c1ccccc1
: