Target
Amyloid-beta A4 precursor protein-binding family A member 1
Ligand
BDBM40956
Substrate
Meas. Tech.
uHTS Homogeneous Terbium Time-Resolved Fluorescence Resonance Energy Transfer (HTRF) Assay
IC50
47300±n/a nM
Citation
 PubChem, PC uHTS Homogeneous Terbium Time-Resolved Fluorescence Resonance Energy Transfer (HTRF) Assay PubChem Bioassay (2009)[AID] 
Target
Name:
Amyloid-beta A4 precursor protein-binding family A member 1
Synonyms:
APBA1_RAT Mint1 neuronal munc18-1 binding protein
Type:
Enzyme Catalytic Domain
Mol. Mass.:
92603.32
Organism:
Rattus norvegicus
Description:
gi_2625023
Residue:
839
  
Inhibitor
Name:
BDBM40956
Synonyms:
1-[2-[4-(4-chlorobenzyl)oxyphenyl]-4-cyano-oxazol-5-yl]isonipecotamide 1-[2-[4-[(4-chlorophenyl)methoxy]phenyl]-4-cyano-5-oxazolyl]-4-piperidinecarboxamide SMR000044900 | cid_664100
Type:
Small organic molecule
Emp. Form.:
C23H21ClN4O3
Mol. Mass.:
436.891
SMILES:
NC(=O)C1CCN(CC1)c1oc(nc1C#N)-c1ccc(OCc2ccc(Cl)cc2)cc1
: