Target
Streptokinase A
Ligand
BDBM58001
Substrate
Meas. Tech.
Absorbance Microorganism-Based Dose Response HTS to Identify Inhibitors of Streptokinase Expression
EC50
150000±n/a nM
Citation
 PubChem, PC Absorbance Microorganism-Based Dose Response HTS to Identify Inhibitors of Streptokinase Expression PubChem Bioassay (2009)[AID] 
Target
Name:
Streptokinase A
Synonyms:
STRP_STRP1 streptokinase A precursor
Type:
Enzyme Catalytic Domain
Mol. Mass.:
49924.80
Organism:
Streptococcus pyogenes M1 GAS
Description:
gi_15675770
Residue:
440
  
Inhibitor
Name:
BDBM58001
Synonyms:
6-amino-1-(2-methoxyethyl)-N-(4-methylphenyl)sulfonyl-2,4-dioxo-5-pyrimidinecarboxamide 6-amino-2,4-diketo-1-(2-methoxyethyl)-N-tosyl-pyrimidine-5-carboxamide MLS001002636 cid_2445561
Type:
Small organic molecule
Emp. Form.:
C15H18N4O6S
Mol. Mass.:
382.392
SMILES:
COCCn1c(N)c(C(=O)NS(=O)(=O)c2ccc(C)cc2)c(=O)[nH]c1=O
: