Target
Streptokinase A
Ligand
BDBM58072
Substrate
Meas. Tech.
Absorbance Microorganism-Based Dose Response HTS to Identify Inhibitors of Streptokinase Expression
EC50
150000±n/a nM
Citation
 PubChem, PC Absorbance Microorganism-Based Dose Response HTS to Identify Inhibitors of Streptokinase Expression PubChem Bioassay (2009)[AID] 
Target
Name:
Streptokinase A
Synonyms:
STRP_STRP1 streptokinase A precursor
Type:
Enzyme Catalytic Domain
Mol. Mass.:
49924.80
Organism:
Streptococcus pyogenes M1 GAS
Description:
gi_15675770
Residue:
440
  
Inhibitor
Name:
BDBM58072
Synonyms:
2-N-butan-2-yl-4-N-(2,5-dimethoxyphenyl)-5-nitropyrimidine-2,4,6-triamine N-sec-Butyl-N'-(2,5-dimethoxy-phenyl)-5-nitro-pyrimidine-2,4,6-triamine N2-butan-2-yl-N4-(2,5-dimethoxyphenyl)-5-nitropyrimidine-2,4,6-triamine [4-amino-6-(2,5-dimethoxyanilino)-5-nitro-pyrimidin-2-yl]-sec-butyl-amine | cid_3336201
Type:
Small organic molecule
Emp. Form.:
C16H22N6O4
Mol. Mass.:
362.3837
SMILES:
CCC(C)Nc1nc(N)c(c(Nc2cc(OC)ccc2OC)n1)[N+]([O-])=O
: