Target
Streptokinase A
Ligand
BDBM53041
Substrate
Meas. Tech.
Absorbance Microorganism-Based Dose Response HTS to Identify Inhibitors of Streptokinase Expression
EC50
150000±n/a nM
Citation
 PubChem, PC Absorbance Microorganism-Based Dose Response HTS to Identify Inhibitors of Streptokinase Expression PubChem Bioassay (2009)[AID] 
Target
Name:
Streptokinase A
Synonyms:
STRP_STRP1 streptokinase A precursor
Type:
Enzyme Catalytic Domain
Mol. Mass.:
49924.80
Organism:
Streptococcus pyogenes M1 GAS
Description:
gi_15675770
Residue:
440
  
Inhibitor
Name:
BDBM53041
Synonyms:
MLS001181166 N''''-[(E)-(3-chloro-5-nitro-6-oxo-1-cyclohexa-2,4-dienylidene)methyl]-2-hydroxy-2,2-diphenylacetohydrazide N''''-[(E)-(3-chloro-6-keto-5-nitro-cyclohexa-2,4-dien-1-ylidene)methyl]-2-hydroxy-2,2-diphenyl-acetohydrazide O-acyl oxime isatin derivative, 41 cid_5498930
Type:
Small organic molecule
Emp. Form.:
C21H16ClN3O5
Mol. Mass.:
425.822
SMILES:
OC(C(=O)N\[NH+]=C\[c-]1cc(Cl)cc([N+]([O-])=O)c1=O)(c1ccccc1)c1ccccc1
: